BDBM50010903 5-Cyclohexyl-2,2-difluoro-3-oxo-4-[2-(8-propyl-6-pyridin-3-yl-[1,2,4]triazolo[4,3-a]pyrazin-3-yl)-acetylamino]-pentanoic acid (2-methyl-butyl)-amide::CHEMBL38551
SMILES CCCc1nc(cn2c(CC(=O)NC(CC3CCCCC3)C(=O)C(F)(F)C(=O)NCC(C)CC)nnc12)-c1cccnc1
InChI Key InChIKey=RSUAWWYWUMUUTA-UHFFFAOYSA-N
Data  1 IC50
  Tab Delimited (TSV)   2D SDfile   Computed 3D by Vconf -m prep SDfile
Find this compound or compounds like it in BindingDB:
Activity Spreadsheet -- Enzyme Inhibition Constant Data from BindingDB
Found 1 hit for monomerid = 50010903
TargetRenin(Homo sapiens (Human))
Ici Pharmaceuticals Group
Curated by ChEMBL
LigandPNGBDBM50010903(5-Cyclohexyl-2,2-difluoro-3-oxo-4-[2-(8-propyl-6-p...)
Affinity DataIC50:  1.70nM. Assay description: Inhibition of human renin
In DepthDetails ArticlePubMed