BDBM50010950 3-(2,5-Dimethyl-3,6-dioxo-4-pyridin-3-ylmethyl-cyclohexa-1,4-dienyl)-acrylic acid::CHEMBL92083
SMILES OC(=O)C=Cc1c(O)c(=C)c(Cc2cccnc2)c(O)c1=C
InChI Key InChIKey=IOGJXULPCPRHDL-UHFFFAOYSA-N
Data  2 IC50
  Tab Delimited (TSV)   2D SDfile   Computed 3D by Vconf -m prep SDfile
Find this compound or compounds like it in BindingDB:
Activity Spreadsheet -- Enzyme Inhibition Constant Data from BindingDB
Found 2 hits for monomerid = 50010950
TargetPolyunsaturated fatty acid 5-lipoxygenase(Rattus norvegicus)
Takeda Chemical Industries
Curated by ChEMBL
LigandPNGBDBM50010950(3-(2,5-Dimethyl-3,6-dioxo-4-pyridin-3-ylmethyl-cyc...)
Affinity DataIC50:  8.80E+3nM. Assay description: The concentration required to reduce by 50% the amount of LTB4 formed by RBL-1 cells
In DepthDetails ArticlePubMed
TargetThromboxane-A synthase(Homo sapiens (Human))
Takeda Chemical Industries
Curated by ChEMBL
LigandPNGBDBM50010950(3-(2,5-Dimethyl-3,6-dioxo-4-pyridin-3-ylmethyl-cyc...)
Affinity DataIC50:  500nM. Assay description: Inhibition of horse thromboxane A2 synthase evaluated as molar concentration required to reduce thromboxane B2 formed after incubating PGH-2 with pla...
In DepthDetails ArticlePubMed