BDBM50010951 Acetic acid 5-pyridin-3-yl-5-(2,4,5-trimethyl-3,6-dioxo-cyclohexa-1,4-dienyl)-pentyl ester::CHEMBL92933
SMILES CC(=O)OCCCC=C(c1cccnc1)c1c(C)c(O)c(C)c(C)c1O
InChI Key InChIKey=YTEWOXUCMXKFPR-UHFFFAOYSA-N
Data  3 IC50
  Tab Delimited (TSV)   2D SDfile   Computed 3D by Vconf -m prep SDfile
Find this compound or compounds like it in BindingDB:
Activity Spreadsheet -- Enzyme Inhibition Constant Data from BindingDB
Found 3 hits for monomerid = 50010951
TargetPolyunsaturated fatty acid 5-lipoxygenase(Rattus norvegicus)
Takeda Chemical Industries
Curated by ChEMBL
LigandPNGBDBM50010951(Acetic acid 5-pyridin-3-yl-5-(2,4,5-trimethyl-3,6-...)
Affinity DataIC50:  820nM. Assay description: Reduction of lipid peroxide formed in rat brain homogenates.
In DepthDetails ArticlePubMed
TargetPolyunsaturated fatty acid 5-lipoxygenase(Rattus norvegicus)
Takeda Chemical Industries
Curated by ChEMBL
LigandPNGBDBM50010951(Acetic acid 5-pyridin-3-yl-5-(2,4,5-trimethyl-3,6-...)
Affinity DataIC50:  250nM. Assay description: The concentration required to reduce by 50% the amount of LTB4 formed by RBL-1 cells
In DepthDetails ArticlePubMed
TargetThromboxane-A synthase(Homo sapiens (Human))
Takeda Chemical Industries
Curated by ChEMBL
LigandPNGBDBM50010951(Acetic acid 5-pyridin-3-yl-5-(2,4,5-trimethyl-3,6-...)
Affinity DataIC50:  1.50E+3nM. Assay description: Inhibition of horse thromboxane A2 synthase evaluated as molar concentration required to reduce thromboxane B2 formed after incubating PGH-2 with pla...
In DepthDetails ArticlePubMed