BDBM50011037 6-{2-[4-(4-Fluoro-phenyl)-2-isopropyl-quinolin-3-yl]-vinyl}-4-hydroxy-tetrahydro-pyran-2-one::CHEMBL333933
SMILES CC(C)c1nc2ccccc2c(-c2ccc(F)cc2)c1\C=C\[C@@H]1C[C@@H](O)CC(=O)O1
InChI Key InChIKey=IOTZDEROGUWISV-MCBHFWOFSA-N
Data  1 IC50
  Tab Delimited (TSV)   2D SDfile   Computed 3D by Vconf -m prep SDfile
Find this compound or compounds like it in BindingDB:
Activity Spreadsheet -- Enzyme Inhibition Constant Data from BindingDB
Found 1 hit for monomerid = 50011037
Target3-hydroxy-3-methylglutaryl-coenzyme A reductase(Rattus norvegicus (rat))
Warner-Lambert
Curated by ChEMBL
LigandPNGBDBM50011037(6-{2-[4-(4-Fluoro-phenyl)-2-isopropyl-quinolin-3-y...)
Affinity DataIC50:  32nM. Assay description: Compound was evaluated for the inhibition of HMG-CoA reductase (COR) in rats.
In DepthDetails ArticlePubMed