BDBM50011053 CHEMBL125576::Tetrahydrofuran derivative
SMILES CCCCCCCCCCCCCCCNOC(=O)CC1COC(COC(=O)N(Cc2cccc[n+]2CC)C(C)=O)C1
InChI Key InChIKey=PRKQDLYCOZUITP-UHFFFAOYSA-N
Data  2 IC50
  Tab Delimited (TSV)   2D SDfile   Computed 3D by Vconf -m prep SDfile
Find this compound or compounds like it in BindingDB:
Activity Spreadsheet -- Enzyme Inhibition Constant Data from BindingDB
Found 2 hits for monomerid = 50011053
TargetPlatelet-activating factor receptor(Cavia porcellus)
J. Uriach & CíA.
Curated by ChEMBL
LigandPNGBDBM50011053(CHEMBL125576 | Tetrahydrofuran derivative)
Affinity DataIC50:  4.5nM. Assay description: Inhibitory activity expressed as the concentration required to inhibit platelet-activating factor (PAF) induced maximum aggregation by 50%
In DepthDetails ArticlePubMed
TargetPlatelet-activating factor receptor(Cavia porcellus)
J. Uriach & CíA.
Curated by ChEMBL
LigandPNGBDBM50011053(CHEMBL125576 | Tetrahydrofuran derivative)
Affinity DataIC50:  8nM. Assay description: Inhibitory activity expressed as the concentration required to inhibit platelet-activating factor (PAF) induced maximum aggregation by 50%
In DepthDetails ArticlePubMed