BDBM50011060 2-{[Acetyl-(2-octadecyloxymethyl-[1,3]dioxolan-4-ylmethoxycarbonyl)-amino]-methyl}-1-ethyl-pyridinium; iodide::CHEMBL125412
SMILES CCCCCCCCCCCCCCCCCCOCC1OCC(COC(=O)N(Cc2cccc[n+]2CC)C(C)=O)O1
InChI Key InChIKey=DBAVXLWRIXGFKJ-UHFFFAOYSA-N
Data  1 IC50
  Tab Delimited (TSV)   2D SDfile   Computed 3D by Vconf -m prep SDfile
Find this compound or compounds like it in BindingDB:
Activity Spreadsheet -- Enzyme Inhibition Constant Data from BindingDB
Found 1 hit for monomerid = 50011060
TargetPlatelet-activating factor receptor(Cavia porcellus)
J. Uriach & CíA.
Curated by ChEMBL
LigandPNGBDBM50011060(2-{[Acetyl-(2-octadecyloxymethyl-[1,3]dioxolan-4-y...)
Affinity DataIC50:  140nM. Assay description: Inhibitory activity expressed as the concentration required to inhibit platelet-activating factor (PAF) induced maximum aggregation by 50%
In DepthDetails ArticlePubMed