BDBM50011068 CHEMBL339676::Toluene-4-sulfonate3-[5-(5-pentadecyl-tetrahydro-furan-2-ylmethoxycarbonyl)-pentyl]-thiazol-3-ium;Toluene-4-sulfonate
SMILES CCCCCCCCCCCCCCCC1CCC(COC(=O)CCCCC[n+]2ccsc2)O1
InChI Key InChIKey=YQSBUAWYSINAJX-UHFFFAOYSA-N
Data  1 IC50
  Tab Delimited (TSV)   2D SDfile   Computed 3D by Vconf -m prep SDfile
Find this compound or compounds like it in BindingDB:
Activity Spreadsheet -- Enzyme Inhibition Constant Data from BindingDB
Found 1 hit for monomerid = 50011068
TargetPlatelet-activating factor receptor(Cavia porcellus)
J. Uriach & CíA.
Curated by ChEMBL
LigandPNGBDBM50011068(CHEMBL339676 | Toluene-4-sulfonate3-[5-(5-pentadec...)
Affinity DataIC50:  3.10E+3nM. Assay description: Inhibitory activity expressed as the concentration required to inhibit platelet-activating factor (PAF) induced maximum aggregation by 50%
In DepthDetails ArticlePubMed