BDBM50011092 1-Ethyl-2-[(4-hexadecyloxymethyl-tetrahydro-furan-2-ylmethoxycarbonylamino)-methyl]-pyridinium; iodide::CHEMBL340480
SMILES CCCCCCCCCCCCCCCCOCC1COC(COC(=O)NCc2cccc[n+]2CC)C1
InChI Key InChIKey=AURHGHMHMUQEIH-UHFFFAOYSA-O
Data  1 IC50
  Tab Delimited (TSV)   2D SDfile   Computed 3D by Vconf -m prep SDfile
Find this compound or compounds like it in BindingDB:
Activity Spreadsheet -- Enzyme Inhibition Constant Data from BindingDB
Found 1 hit for monomerid = 50011092
TargetPlatelet-activating factor receptor(Cavia porcellus)
J. Uriach & CíA.
Curated by ChEMBL
LigandPNGBDBM50011092(1-Ethyl-2-[(4-hexadecyloxymethyl-tetrahydro-furan-...)
Affinity DataIC50:  5.30E+3nM. Assay description: Inhibitory activity expressed as the concentration required to inhibit platelet-activating factor (PAF) induced maximum aggregation by 50%
In DepthDetails ArticlePubMed