BDBM50011102 3-{[Acetyl-(4-octadecyloxymethyl-tetrahydro-furan-2-ylmethoxycarbonyl)-amino]-methyl}-1-ethyl-pyridinium; iodide::CHEMBL127374
SMILES CCCCCCCCCCCCCCCCCCOCC1COC(COC(=O)N(Cc2ccc[n+](CC)c2)C(C)=O)C1
InChI Key InChIKey=QLAUIMJZDQKTHG-UHFFFAOYSA-N
Data  1 IC50
  Tab Delimited (TSV)   2D SDfile   Computed 3D by Vconf -m prep SDfile
Find this compound or compounds like it in BindingDB:
Activity Spreadsheet -- Enzyme Inhibition Constant Data from BindingDB
Found 1 hit for monomerid = 50011102
TargetPlatelet-activating factor receptor(Cavia porcellus)
J. Uriach & CíA.
Curated by ChEMBL
LigandPNGBDBM50011102(3-{[Acetyl-(4-octadecyloxymethyl-tetrahydro-furan-...)
Affinity DataIC50:  2.50E+3nM. Assay description: Inhibitory activity expressed as the concentration required to inhibit platelet-activating factor (PAF) induced maximum aggregation by 50%
In DepthDetails ArticlePubMed