BDBM50011122 1-Ethyl-4-(4-octadecyloxymethyl-tetrahydro-furan-2-ylmethoxycarbonylamino)-pyridinium; iodide::CHEMBL124799
SMILES CCCCCCCCCCCCCCCCCCOCC1COC(COC(=O)[NH+]=c2ccn(CC)cc2)C1
InChI Key InChIKey=HJGMLIHBBWUCJL-UHFFFAOYSA-O
Data  1 IC50
  Tab Delimited (TSV)   2D SDfile   Computed 3D by Vconf -m prep SDfile
Find this compound or compounds like it in BindingDB:
Activity Spreadsheet -- Enzyme Inhibition Constant Data from BindingDB
Found 1 hit for monomerid = 50011122
TargetPlatelet-activating factor receptor(Cavia porcellus)
J. Uriach & CíA.
Curated by ChEMBL
LigandPNGBDBM50011122(1-Ethyl-4-(4-octadecyloxymethyl-tetrahydro-furan-2...)
Affinity DataIC50:  1.90E+3nM. Assay description: Inhibitory activity expressed as the concentration required to inhibit platelet-activating factor (PAF) induced maximum aggregation by 50%
In DepthDetails ArticlePubMed