BDBM50011246 4-Propyl-1,2,3,4,4a,5,6,10b-octahydro-benzo[f]quinolin-10-ol; hydrochloride::CHEMBL543459
SMILES CCCN1CCC[C@@H]2[C@@H]1CCc1cccc(O)c21
InChI Key InChIKey=PXQVPBZSEWLGIX-KGLIPLIRSA-N
Data  1 KI
  Tab Delimited (TSV)   2D SDfile   Computed 3D by Vconf -m prep SDfile
Find this compound or compounds like it in BindingDB:
Activity Spreadsheet -- Enzyme Inhibition Constant Data from BindingDB
Found 1 hit for monomerid = 50011246
Target5-hydroxytryptamine receptor 1A(Rattus norvegicus (rat))
Uppsala University
Curated by ChEMBL
LigandPNGBDBM50011246(4-Propyl-1,2,3,4,4a,5,6,10b-octahydro-benzo[f]quin...)
Affinity DataKi:  3.90nM. Assay description: Binding affinity at 5-hydroxytryptamine 1A receptor by the displacement of [3H]8-OH-DPAT in rat brain.
In DepthDetails ArticlePubMed