BDBM50011350 CHEMBL3143484::Phosphoric acid mono-{2-[2-(1-{[1-(2-hydroxy-1-isobutyl-5-methyl-4-{2-methyl-1-[(pyridin-2-ylmethyl)-carbamoyl]-butylcarbamoyl}-hexylcarbamoyl)-2-(3H-imidazol-4-yl)-ethyl]-methyl-carbamoyl}-2-phenyl-ethylcarbamoyl)-pyrrolidin-1-yl]-2-oxo-ethyl} ester
SMILES CC[C@H](C)[C@H](NC(=O)[C@@H](C[C@H](O)[C@H](CC(C)C)NC(=O)[C@H](Cc1c[nH]cn1)N(C)C(=O)[C@H](Cc1ccccc1)NC(=O)[C@@H]1CCCN1C(=O)COP(O)(O)=O)C(C)C)C(=O)NCc1ccccn1
InChI Key InChIKey=AFIXYRQKZYZNRD-UHFFFAOYSA-N
Data  1 IC50
  Tab Delimited (TSV)   2D SDfile   Computed 3D by Vconf -m prep SDfile
Find this compound or compounds like it in BindingDB:
Activity Spreadsheet -- Enzyme Inhibition Constant Data from BindingDB
Found 1 hit for monomerid = 50011350
TargetRenin(Homo sapiens (Human))
Upjohn
Curated by ChEMBL
LigandPNGBDBM50011350(CHEMBL3143484 | Phosphoric acid mono-{2-[2-(1-{[1-...)
Affinity DataIC50:  1.60nM. Assay description: Inhibition of human plasma renin.
In DepthDetails ArticlePubMed