BDBM50011359 1-[2-(1-Carboxy-3-phenyl-propylamino)-propionyl]-pyrrolidine-2-carboxylic acid::CHEMBL348537
SMILES C[C@@H](NC(CCc1ccccc1)C(O)=O)C(=O)N1CCCC1C(O)=O
InChI Key InChIKey=LZFZMUMEGBBDTC-LRVUVFPRSA-N
Data  1 IC50
  Tab Delimited (TSV)   2D SDfile   Computed 3D by Vconf -m prep SDfile
Find this compound or compounds like it in BindingDB:
Activity Spreadsheet -- Enzyme Inhibition Constant Data from BindingDB
Found 1 hit for monomerid = 50011359
TargetAngiotensin-converting enzyme(Oryctolagus cuniculus)
Institut De Chimie Des Substances Naturelles
Curated by ChEMBL
LigandPNGBDBM50011359(1-[2-(1-Carboxy-3-phenyl-propylamino)-propionyl]-p...)
Affinity DataIC50:  2.50E+3nM. Assay description: In vitro activity against angiotensin I converting enzyme especially against Hip-His-Leu residues
In DepthDetails ArticlePubMed