BDBM50011443 2-(3,5-Dimethoxy-phenyl)-4-oxo-4H-chromene-3-carboxylic acid methyl ester::CHEMBL353865::methyl 2-(3,5-dimethoxyphenyl)-4-oxo-4H-chromene-3-carboxylate
SMILES COC(=O)c1c(oc2ccccc2c1=O)-c1cc(OC)cc(OC)c1
InChI Key InChIKey=JOZHCGKRCMPNAA-UHFFFAOYSA-N
Data  1 IC50
  Tab Delimited (TSV)   2D SDfile   Computed 3D by Vconf -m prep SDfile
Find this compound or compounds like it in BindingDB:
Activity Spreadsheet -- Enzyme Inhibition Constant Data from BindingDB
Found 1 hit for monomerid = 50011443
TargetTyrosine-protein kinase Lck(Homo sapiens (Human))
Purdue University
Curated by ChEMBL
LigandPNGBDBM50011443(2-(3,5-Dimethoxy-phenyl)-4-oxo-4H-chromene-3-carbo...)
Affinity DataIC50: >2.00E+6nM. Assay description: Ability to inhibit protein-tyrosine kinase activity of p56lck (isolated from bovine thymus) in vitro.
In DepthDetails ArticlePubMed