BDBM50011460 2-(4-Acetylamino-phenyl)-7-methoxy-4-oxo-4H-chromene-3-carboxylic acid methyl ester::CHEMBL352715::methyl 2-(4-acetamidophenyl)-7-methoxy-4-oxo-4H-chromene-3-carboxylate
SMILES COC(=O)c1c(oc2cc(OC)ccc2c1=O)-c1ccc(NC(C)=O)cc1
InChI Key InChIKey=PPANIPQSJWHNSL-UHFFFAOYSA-N
Data  1 IC50
  Tab Delimited (TSV)   2D SDfile   Computed 3D by Vconf -m prep SDfile
Find this compound or compounds like it in BindingDB:
Activity Spreadsheet -- Enzyme Inhibition Constant Data from BindingDB
Found 1 hit for monomerid = 50011460
TargetTyrosine-protein kinase Lck(Homo sapiens (Human))
Purdue University
Curated by ChEMBL
LigandPNGBDBM50011460(2-(4-Acetylamino-phenyl)-7-methoxy-4-oxo-4H-chrome...)
Affinity DataIC50: >2.00E+6nM. Assay description: Ability to inhibit protein-tyrosine kinase activity of p56lck (isolated from bovine thymus) in vitro.
In DepthDetails ArticlePubMed