BDBM50011580 5-Amino-1-[1-(1-hydroxy-ethyl)-heptyl]-1H-imidazole-4-carboxylic acid amide::CHEMBL17870
SMILES CCCCCCC(C(C)O)n1cnc(C(N)=O)c1N
InChI Key InChIKey=STHVACLWCWRYEV-UHFFFAOYSA-N
Data  1 KI
  Tab Delimited (TSV)   2D SDfile   Computed 3D by Vconf -m prep SDfile
Find this compound or compounds like it in BindingDB:
Activity Spreadsheet -- Enzyme Inhibition Constant Data from BindingDB
Found 1 hit for monomerid = 50011580
TargetAdenosine deaminase(Bos taurus (bovine))
Universit£
Curated by ChEMBL
LigandPNGBDBM50011580(5-Amino-1-[1-(1-hydroxy-ethyl)-heptyl]-1H-imidazol...)
Affinity DataKi:  1.04E+3nM. Assay description: Inhibition of calf intestinal adenosine deaminase
In DepthDetails ArticlePubMed