BDBM50011806 CHEMBL3262941
SMILES CC(C)CC(CC(C)C)CC(=O)OCC1(CO)C\C(=C/c2cccc(c2)C(C(=O)OC(C)(C)C)C(=O)OC(C)(C)C)C(=O)O1
InChI Key InChIKey=FVFPUXPUIUZWKX-WPWMEQJKSA-N
Data  1 Kd
  Tab Delimited (TSV)   2D SDfile   Computed 3D by Vconf -m prep SDfile
Find this compound or compounds like it in BindingDB:
Activity Spreadsheet -- Enzyme Inhibition Constant Data from BindingDB
Found 1 hit for monomerid = 50011806
TargetProtein kinase C delta type(Mus musculus)
National Cancer Institute-Bethesda
Curated by ChEMBL
LigandPNGBDBM50011806(CHEMBL3262941)
Affinity DataKd:  0.5nM. Assay description: Displacement of [20-3H]PDBu from GST-tagged full-length mouse PKC-delta C1B domain expressed in Escherichia coli after 2 to 30 mins by polyethylene g...
In DepthDetails ArticlePubMed