BDBM50011989 CHEMBL3263271
SMILES [H][C@@]12C[C@H](C[C@@]1(CCO2)C(=O)N1CCc2ncc(OC(F)(F)F)cc2C1)NC1CCOCC1OC
InChI Key InChIKey=XEMHVBQQUMCBNV-BJBHDXBJSA-N
Data  1 IC50
  Tab Delimited (TSV)   2D SDfile   Computed 3D by Vconf -m prep SDfile
Find this compound or compounds like it in BindingDB:
Activity Spreadsheet -- Enzyme Inhibition Constant Data from BindingDB
Found 1 hit for monomerid = 50011989
TargetC-C chemokine receptor type 2(Homo sapiens (Human))
Janssen Research And Development
Curated by ChEMBL
LigandPNGBDBM50011989(CHEMBL3263271)
Affinity DataIC50:  27nM. Assay description: Displacement of labeled MCP-1 from human CCR2 expressed in THP1 cells
In DepthDetails ArticlePubMed