BDBM50012330 11-[2-(4-Methanesulfonyl-piperazin-1-yl)-acetyl]-5,11-dihydro-benzo[e]pyrido[3,2-b][1,4]diazepin-6-one::CHEMBL302995
SMILES CS(=O)(=O)N1CCN(CC(=O)N2c3ccccc3C(=O)Nc3cccnc23)CC1
InChI Key InChIKey=WDKADHXAXWKMLD-UHFFFAOYSA-N
Data  4 KI
  Tab Delimited (TSV)   2D SDfile   Computed 3D by Vconf -m prep SDfile
Find this compound or compounds like it in BindingDB:
Activity Spreadsheet -- Enzyme Inhibition Constant Data from BindingDB
Found 4 hits for monomerid = 50012330
LigandPNGBDBM50012330(11-[2-(4-Methanesulfonyl-piperazin-1-yl)-acetyl]-5...)
Affinity DataKi: >1.00E+5nM. Assay description: Inhibition of binding of [3H]-N-methylscopolamine to muscarinic acetylcholine receptor M1 of transfected rat A9L cells.
In DepthDetails ArticlePubMed
LigandPNGBDBM50012330(11-[2-(4-Methanesulfonyl-piperazin-1-yl)-acetyl]-5...)
Affinity DataKi: >1.00E+5nM. Assay description: Inhibition of binding of [3H]-N-methylscopolamine to muscarinic acetylcholine receptor M3 of transfected rat A9L cells.
In DepthDetails ArticlePubMed
LigandPNGBDBM50012330(11-[2-(4-Methanesulfonyl-piperazin-1-yl)-acetyl]-5...)
Affinity DataKi: >1.00E+5nM. Assay description: Inhibition of binding of [3H]-N-methylscopolamine to muscarinic acetylcholine receptor M2 of rat heart tissue membrane.
In DepthDetails ArticlePubMed
LigandPNGBDBM50012330(11-[2-(4-Methanesulfonyl-piperazin-1-yl)-acetyl]-5...)
Affinity DataKi: >1.00E+5nM. Assay description: Inhibition of binding of [3H]-N-Methyl-scopolamine to muscarinic acetylcholine receptor M4 of rat heart NG108-15 cells
In DepthDetails ArticlePubMed