BDBM50012762 (+)6'-chloro-2'-methyl-2,5-dioxo-(2'R,4'S)-spiro[1H,2H-imidazole-4,4'-(3',4'-dihydro-2'H-pyrano[2,3-b]pyridine)-8'-ium]-8'-olate::(+/-)-6'-chloro-2'-methyl-2,5-dioxo-(2'R,4'S)-spiro[1H,2H-imidazole-4,4'-(3',4'-dihydro-2'H-pyrano[2,3-b]pyridine)-8'-ium]-8'-olate::CHEMBL56424
SMILES C[C@@H]1C[C@]2(NC(=O)NC2=O)c2cc(Cl)c[n+]([O-])c2O1
InChI Key InChIKey=PDGNPUKHQOYMGH-GCXOYZPQSA-N
Data  2 IC50
  Tab Delimited (TSV)   2D SDfile   Computed 3D by Vconf -m prep SDfile
Find this compound or compounds like it in BindingDB:
Activity Spreadsheet -- Enzyme Inhibition Constant Data from BindingDB
Found 2 hits for monomerid = 50012762
TargetAldo-keto reductase family 1 member B1(Homo sapiens (Human))
Pfizer
Curated by ChEMBL
LigandPNGBDBM50012762((+)6'-chloro-2'-methyl-2,5-dioxo-(2'R,4'S)-spiro[1...)
Affinity DataIC50:  130nM. Assay description: In vitro inhibitory activity against Aldose reductase isolated from human placenta
In DepthDetails ArticlePubMed
TargetAldo-keto reductase family 1 member B1(Homo sapiens (Human))
Pfizer
Curated by ChEMBL
LigandPNGBDBM50012762((+)6'-chloro-2'-methyl-2,5-dioxo-(2'R,4'S)-spiro[1...)
Affinity DataIC50:  130nM. Assay description: In vitro inhibitory activity against Aldose reductase isolated from human placenta
In DepthDetails ArticlePubMed