BDBM50012767 (+/-)-6'-chloro-2'-methyl-(2'S,4'S)-spiro[1H,2H-imidazole-4,4'-(3',4'-dihydro-2'H-pyrano[2,3-b]pyridine)]-2,5-dione::CHEMBL294612
SMILES C[C@H]1C[C@]2(NC(=O)NC2=O)c2cc(Cl)cnc2O1
InChI Key InChIKey=WFPFAWQUEPGPQT-DYEAUMGKSA-N
Data  1 IC50
  Tab Delimited (TSV)   2D SDfile   Computed 3D by Vconf -m prep SDfile
Find this compound or compounds like it in BindingDB:
Activity Spreadsheet -- Enzyme Inhibition Constant Data from BindingDB
Found 1 hit for monomerid = 50012767
TargetAldo-keto reductase family 1 member B1(Homo sapiens (Human))
Pfizer
Curated by ChEMBL
LigandPNGBDBM50012767((+/-)-6'-chloro-2'-methyl-(2'S,4'S)-spiro[1H,2H-im...)
Affinity DataIC50:  890nM. Assay description: In vitro inhibitory activity against Aldose reductase isolated from human placenta
In DepthDetails ArticlePubMed