BDBM50012906 CHEMBL3261323::USRE46024, 10
SMILES CC(C)c1cc(Oc2c(Cl)cc(CC(O)=O)cc2Cl)nn(C)c1=O
InChI Key InChIKey=OORLQBMJWSBLOY-UHFFFAOYSA-N
Data  3 EC50
  Tab Delimited (TSV)   2D SDfile   Computed 3D by Vconf -m prep SDfile
Find this compound or compounds like it in BindingDB:
Activity Spreadsheet -- Enzyme Inhibition Constant Data from BindingDB
Found 3 hits for monomerid = 50012906
TargetRetinoic acid receptor RXR-alpha [225-462]/Thyroid hormone receptor beta [148-410](Homo sapiens (Human))
Hoffmann-La Roche
US Patent
LigandPNGBDBM50012906(CHEMBL3261323 | USRE46024, 10)
Affinity DataEC50:  767nMpH: 7.0Assay Description:Thirty microliters of H6-TRβ (50 nM) in 50 mM Hepes, pH 7.0, 1 mM DTT, 0.05% NP40 and 0.2 mg/ml BSA (Binding Buffer) was mixed with an equal vol...
In DepthDetails US Patent
TargetThyroid hormone receptor beta(Homo sapiens (Human))
Madrigal Pharmaceuticals
Curated by ChEMBL
LigandPNGBDBM50012906(CHEMBL3261323 | USRE46024, 10)
Affinity DataEC50:  770nM. Assay description: Agonist activity at recombinant His6-tagged THR-beta (unknown origin) expressed in Escherichia coli BL21(DE3) co-expressing RXR preincubated for 30 m...
In DepthDetails ArticlePubMed
TargetThyroid hormone receptor alpha(Homo sapiens (Human))
Madrigal Pharmaceuticals
Curated by ChEMBL
LigandPNGBDBM50012906(CHEMBL3261323 | USRE46024, 10)
Affinity DataEC50:  780nM. Assay description: Agonist activity at recombinant His6-tagged THR-alpha (unknown origin) expressed in Escherichia coli BL21(DE3) co-expressing RXR preincubated for 30 ...
In DepthDetails ArticlePubMed