BDBM50012910 CHEMBL3261326::USRE46024, 14
SMILES CC(C)c1cc(Cc2c(Cl)cc(CC(O)=O)cc2Cl)n[nH]c1=O
InChI Key InChIKey=HNQWGSLKZWUEDQ-UHFFFAOYSA-N
Data  3 EC50
  Tab Delimited (TSV)   2D SDfile   Computed 3D by Vconf -m prep SDfile
Find this compound or compounds like it in BindingDB:
Activity Spreadsheet -- Enzyme Inhibition Constant Data from BindingDB
Found 3 hits for monomerid = 50012910
TargetRetinoic acid receptor RXR-alpha [225-462]/Thyroid hormone receptor beta [148-410](Homo sapiens (Human))
Hoffmann-La Roche
US Patent
LigandPNGBDBM50012910(CHEMBL3261326 | USRE46024, 14)
Affinity DataEC50:  2.99E+3nMpH: 7.0Assay Description:Thirty microliters of H6-TRβ (50 nM) in 50 mM Hepes, pH 7.0, 1 mM DTT, 0.05% NP40 and 0.2 mg/ml BSA (Binding Buffer) was mixed with an equal vol...
In DepthDetails US Patent
TargetThyroid hormone receptor alpha(Homo sapiens (Human))
Madrigal Pharmaceuticals
Curated by ChEMBL
LigandPNGBDBM50012910(CHEMBL3261326 | USRE46024, 14)
Affinity DataEC50:  4.29E+3nM. Assay description: Agonist activity at recombinant His6-tagged THR-alpha (unknown origin) expressed in Escherichia coli BL21(DE3) co-expressing RXR preincubated for 30 ...
In DepthDetails ArticlePubMed
TargetThyroid hormone receptor beta(Homo sapiens (Human))
Madrigal Pharmaceuticals
Curated by ChEMBL
LigandPNGBDBM50012910(CHEMBL3261326 | USRE46024, 14)
Affinity DataEC50:  2.99E+3nM. Assay description: Agonist activity at recombinant His6-tagged THR-beta (unknown origin) expressed in Escherichia coli BL21(DE3) co-expressing RXR preincubated for 30 m...
In DepthDetails ArticlePubMed