BDBM50012929 2-(3-Aminomethyl-benzylamino)-4-methyl-pentanoic acid {2-hydroxy-1-isobutyl-4-[2-(8-isobutyl-6-phenyl-[1,2,4]triazolo[4,3-a]pyrazin-3-yl)-3-pyridin-3-yl-propionylamino]-4-oxo-butyl}-amide . 2H2O::2-(3-Aminomethyl-benzylamino)-4-methyl-pentanoic acid {2-hydroxy-1-isobutyl-4-[2-(8-isobutyl-6-phenyl-[1,2,4]triazolo[4,3-a]pyrazin-3-yl)-3-pyridin-3-yl-propionylamino]-4-oxo-butyl}-amide . 4H2O::CHEMBL307911
SMILES CC(C)CC(NC(=O)C(CC(C)C)NCc1cccc(CN)c1)C(O)CC(=O)NC(=O)C(Cc1cccnc1)c1nnc2c(CC(C)C)nc(cn12)-c1ccccc1
InChI Key InChIKey=XHVWVRVMAWQJBS-UHFFFAOYSA-N
Data  2 IC50
  Tab Delimited (TSV)   2D SDfile   Computed 3D by Vconf -m prep SDfile
Find this compound or compounds like it in BindingDB:
Activity Spreadsheet -- Enzyme Inhibition Constant Data from BindingDB
Found 2 hits for monomerid = 50012929
TargetRenin(Homo sapiens (Human))
Ici Pharmaceuticals Group
Curated by ChEMBL
LigandPNGBDBM50012929(2-(3-Aminomethyl-benzylamino)-4-methyl-pentanoic a...)
Affinity DataIC50:  130nM. Assay description: Tested in vitro for their ability to inhibit human renin incubated with human angiotensinogen
In DepthDetails ArticlePubMed
TargetRenin(Homo sapiens (Human))
Ici Pharmaceuticals Group
Curated by ChEMBL
LigandPNGBDBM50012929(2-(3-Aminomethyl-benzylamino)-4-methyl-pentanoic a...)
Affinity DataIC50:  130nM. Assay description: Tested in vitro for their ability to inhibit human renin incubated with human angiotensinogen
In DepthDetails ArticlePubMed