BDBM50012959 2,3-Dihydro-benzofuran-7-carboxylic acid (1-ethyl-pyrrolidin-2-ylmethyl)-amide::CHEMBL301399
SMILES CCN1CCC[C@H]1CNC(=O)c1cccc2CCOc12
InChI Key InChIKey=SUQDJPATQUWVDW-ZDUSSCGKSA-N
Data  1 KI
  Tab Delimited (TSV)   2D SDfile   Computed 3D by Vconf -m prep SDfile
Find this compound or compounds like it in BindingDB:
Activity Spreadsheet -- Enzyme Inhibition Constant Data from BindingDB
Found 1 hit for monomerid = 50012959
TargetD(2) dopamine receptor(Rattus norvegicus (rat))
University Of Pennsylvania
Curated by ChEMBL
LigandPNGBDBM50012959(2,3-Dihydro-benzofuran-7-carboxylic acid (1-ethyl-...)
Affinity DataKi:  135nM. Assay description: In vivo compound was evaluated for binding towards Dopamine receptor D2 in rat striatal membranes using competitive binding assay and [125I]IBZM radi...
In DepthDetails ArticlePubMed