BDBM50013038 1-(Pyridin-3-ylmethyl)guanidine::CHEMBL93964::N-Pyridin-2-ylmethyl-guanidine
SMILES NC(=N)NCc1ccccn1
InChI Key InChIKey=LXVKOMHNCDIZPY-UHFFFAOYSA-N
Data  1 KI
  Tab Delimited (TSV)   2D SDfile   Computed 3D by Vconf -m prep SDfile
Find this compound or compounds like it in BindingDB:
Activity Spreadsheet -- Enzyme Inhibition Constant Data from BindingDB
Found 1 hit for monomerid = 50013038
Target5-hydroxytryptamine receptor 3B(Mus musculus)
Pfizer
Curated by ChEMBL
LigandPNGBDBM50013038(1-(Pyridin-3-ylmethyl)guanidine | CHEMBL93964 | N-...)
Affinity DataKi:  82nM. Assay description: In vitro binding affinity for the 5-hydroxytryptamine 3 receptor was determined with NG-108-15 mouse neuroblastoma-glioma cells
In DepthDetails ArticlePubMed