BDBM50013046 1-(Thiophen-2-ylmethyl)guanidine::CHEMBL93064::N-Thiophen-2-ylmethyl-guanidine
SMILES NC(=N)NCc1cccs1
InChI Key InChIKey=PUKXJLPQHIYTCF-UHFFFAOYSA-N
Data  2 KI
  Tab Delimited (TSV)   2D SDfile   Computed 3D by Vconf -m prep SDfile
Find this compound or compounds like it in BindingDB:
Activity Spreadsheet -- Enzyme Inhibition Constant Data from BindingDB
Found 2 hits for monomerid = 50013046
Target5-hydroxytryptamine receptor 3B(Mus musculus)
Pfizer
Curated by ChEMBL
LigandPNGBDBM50013046(1-(Thiophen-2-ylmethyl)guanidine | CHEMBL93064 | N...)
Affinity DataKi: >1nM. Assay description: In vitro binding affinity for the 5-hydroxytryptamine 3 receptor was determined with NG-108-15 mouse neuroblastoma-glioma cells
In DepthDetails ArticlePubMed
TargetAlpha-2A/Alpha-2B/Alpha-2C adrenergic receptor(Homo sapiens (Human))
Trinity College
Curated by ChEMBL
LigandPNGBDBM50013046(1-(Thiophen-2-ylmethyl)guanidine | CHEMBL93064 | N...)
Affinity DataKi:  3.93E+3nM. Assay description: Displacement of [3H]RX821002 from alpha2 adrenergic receptor in human brain prefrontal cortex membranes after 30 mins by microbeta liquid scintillati...
In DepthDetails ArticlePubMed