BDBM50013105 13-[2-Amino-3-(4-hydroxy-phenyl)-propionylamino]-7-(4-chloro-benzyl)-3,3,14,14-tetramethyl-6,9,12-trioxo-1,2-dithia-5,8,11-triaza-cyclotetradecane-4-carboxylic acid::CHEMBL405978
SMILES CC1(C)SSC(C)(C)[C@H](NC(=O)[C@@H](N)Cc2ccc(O)cc2)C(=O)NCC(=O)N[C@H](Cc2ccc(Cl)cc2)C(=O)N[C@H]1C(O)=O
InChI Key InChIKey=VTVUYFFDQHWCTJ-SCDRESIJSA-N
Data  2 IC50
  Tab Delimited (TSV)   2D SDfile   Computed 3D by Vconf -m prep SDfile
Find this compound or compounds like it in BindingDB:
Activity Spreadsheet -- Enzyme Inhibition Constant Data from BindingDB
Found 2 hits for monomerid = 50013105
TargetDelta-type opioid receptor(Rattus norvegicus (rat))
University Of Arizona
Curated by ChEMBL
LigandPNGBDBM50013105(13-[2-Amino-3-(4-hydroxy-phenyl)-propionylamino]-7...)
Affinity DataIC50:  1.60nM. Assay description: Ability to displace [3H]DPDPE from Opioid receptor delta 1 in rat brain membranes, was determined from radioreceptor assay.
In DepthDetails ArticlePubMed
TargetMu-type opioid receptor(Rattus norvegicus (rat))
University Of Arizona
Curated by ChEMBL
LigandPNGBDBM50013105(13-[2-Amino-3-(4-hydroxy-phenyl)-propionylamino]-7...)
Affinity DataIC50:  901nM. Assay description: Ability to displace [3H]CTOP from Opioid receptor mu 1 in rat brain membranes, was determined from radioreceptor assay
In DepthDetails ArticlePubMed