BDBM50013213 CHEMBL350103::Sodium salt of7-[4-(4-Fluoro-phenyl)-2-isopropyl-5-methyl-1-phenyl-1H-pyrrol-3-yl]-3,5-dihydroxy-hept-6-enoic acid
SMILES CC(C)c1c(\C=C\[C@@H](O)C[C@@H](O)CC([O-])=O)c(c(C)n1-c1ccccc1)-c1ccc(F)cc1
InChI Key InChIKey=IDWYYPAGRYYRQC-OKRGKCMKSA-M
Data  1 IC50
  Tab Delimited (TSV)   2D SDfile   Computed 3D by Vconf -m prep SDfile
Find this compound or compounds like it in BindingDB:
Activity Spreadsheet -- Enzyme Inhibition Constant Data from BindingDB
Found 1 hit for monomerid = 50013213
Target3-hydroxy-3-methylglutaryl-coenzyme A reductase(Rattus norvegicus (rat))
Hoechst
Curated by ChEMBL
LigandPNGBDBM50013213(CHEMBL350103 | Sodium salt of7-[4-(4-Fluoro-phenyl...)
Affinity DataIC50:  6nM. Assay description: In vitro inhibition of HMG-CoA reductase of rat liver
In DepthDetails ArticlePubMed