BDBM50013220 CHEMBL161829::Sodium salt of7-[4-(4-Fluoro-phenyl)-2,5-dimethyl-1-phenyl-1H-pyrrol-3-yl]-3,5-dihydroxy-heptanoic acid
SMILES Cc1c(CC[C@@H](O)C[C@@H](O)CC([O-])=O)c(c(C)n1-c1ccccc1)-c1ccc(F)cc1
InChI Key InChIKey=QKLXBIHSGMPUQS-FGZHOGPDSA-M
Data  2 IC50
  Tab Delimited (TSV)   2D SDfile   Computed 3D by Vconf -m prep SDfile
Find this compound or compounds like it in BindingDB:
Activity Spreadsheet -- Enzyme Inhibition Constant Data from BindingDB
Found 2 hits for monomerid = 50013220
Target3-hydroxy-3-methylglutaryl-coenzyme A reductase(Rattus norvegicus (rat))
Hoechst
Curated by ChEMBL
LigandPNGBDBM50013220(CHEMBL161829 | Sodium salt of7-[4-(4-Fluoro-phenyl...)
Affinity DataIC50:  70nM. Assay description: In vitro inhibition of HMG-CoA reductase of rat liver
In DepthDetails ArticlePubMed
Target3-hydroxy-3-methylglutaryl-coenzyme A reductase(Homo sapiens (Human))
Hoechst
Curated by ChEMBL
LigandPNGBDBM50013220(CHEMBL161829 | Sodium salt of7-[4-(4-Fluoro-phenyl...)
Affinity DataIC50:  0.570nM. Assay description: Inhibition of cellular HMG-CoA reductase in cultures of hepatic cells (HEP G2, a human hepatoma cell line)
In DepthDetails ArticlePubMed