BDBM50013673 CHEMBL3264509
SMILES [H][C@@]1(CC[C@@]2([H])[C@]3([H])[C@@H](C[C@]4([H])CC(CC[C@]4(C)[C@@]3([H])C[C@H](OC(C)=O)[C@]12C)NCCCNc1ccnc2cc(Cl)ccc12)OC(C)=O)[C@H](C)CCCNCCCNc1ccnc2cc(Cl)ccc12
InChI Key InChIKey=IRURAUBJFXKZDD-YQOPDAEUSA-N
Data  1 KI
  Tab Delimited (TSV)   2D SDfile   Computed 3D by Vconf -m prep SDfile
Find this compound or compounds like it in BindingDB:
Activity Spreadsheet -- Enzyme Inhibition Constant Data from BindingDB
Found 1 hit for monomerid = 50013673
TargetBotulinum neurotoxin type A(Clostridium botulinum)
University Of Belgrade
Curated by ChEMBL
LigandPNGBDBM50013673(CHEMBL3264509)
Affinity DataKi:  171nM. Assay description: Inhibition of Clostridium botulinum recombinant BoNT/A light chain using N-terminal acetylated, C-terminal aminated SNAP-25 (187-203) as substrate by...
In DepthDetails ArticlePubMed