BDBM50013779 4-Benzylamino-Benzoic Acid::CHEMBL32051
SMILES OC(=O)c1ccc(NCc2ccccc2)cc1
InChI Key InChIKey=NYNAMTQEBMCHNG-UHFFFAOYSA-N
Data  2 KI
PDB links: 1 PDB ID matches this monomer.
  Tab Delimited (TSV)   2D SDfile   Computed 3D by Vconf -m prep SDfile
Find this compound or compounds like it in BindingDB:
Activity Spreadsheet -- Enzyme Inhibition Constant Data from BindingDB
Found 2 hits for monomerid = 50013779
TargetCarbonic anhydrase 1(Homo sapiens (Human))
Enscm/Umii/Umr-Cnrs 5635
Curated by ChEMBL
LigandPNGBDBM50013779(4-Benzylamino-Benzoic Acid | CHEMBL32051)
Affinity DataKi:  57nM. Assay description: Inhibition of human carbonic anhydrase 1-catalyzed CO2 hydration preincubated for 10 mins by stopped-flow assay
In DepthDetails ArticlePubMed
TargetCarbonic anhydrase 2(Homo sapiens (Human))
Enscm/Umii/Umr-Cnrs 5635
Curated by ChEMBL
LigandPNGBDBM50013779(4-Benzylamino-Benzoic Acid | CHEMBL32051)
Affinity DataKi:  123nM. Assay description: Inhibition of human carbonic anhydrase 2-catalyzed CO2 hydration preincubated for 10 mins by stopped-flow assay
In DepthDetails ArticlePubMed