BDBM50013953 N-Methyl-2-naphthalen-1-yl-N-(2-pyrrolidin-1-yl-cyclohexyl)-acetamide
SMILES CN(C1CCCC[C@H]1N1CCCC1)C(=O)Cc1cccc2ccccc12
InChI Key InChIKey=WHXOYHJXSJLTPK-FOIFJWKZSA-N
Data  1 IC50
  Tab Delimited (TSV)   2D SDfile   Computed 3D by Vconf -m prep SDfile
Find this compound or compounds like it in BindingDB:
Activity Spreadsheet -- Enzyme Inhibition Constant Data from BindingDB
Found 1 hit for monomerid = 50013953
TargetSigma non-opioid intracellular receptor 1(Homo sapiens (Human))
National Institute Of Diabetes And Digestive And Kidney Diseases
Curated by ChEMBL
LigandPNGBDBM50013953(N-Methyl-2-naphthalen-1-yl-N-(2-pyrrolidin-1-yl-cy...)
Affinity DataIC50:  77nM. Assay description: Binding affinity for sigma opioid receptor using [3H](+)-3-PPP as radioligand
In DepthDetails ArticlePubMed