BDBM50014103 CHEMBL263257::N-[(D-Glucosylamino)carbonyl]-Pro-Phe-N(Me) His-Leu[CHOHCH2]vAL-Ile-AmpO
SMILES CC[C@H](C)[C@H](NC(=O)[C@H](C[C@H](O)[C@H](CC(C)C)NC(=O)[C@H](Cc1cnc[nH]1)N(C)C(=O)[C@H](Cc1ccccc1)NC(=O)[C@@H]1CCCN1C(=O)N[C@H]1[C@@H](O)O[C@H](CO)[C@H](O)[C@@H]1O)C(C)C)C(=O)OCc1ccccn1
InChI Key InChIKey=DALHAGZEAZLVHK-RPJBJRBYSA-N
Data  1 IC50
  Tab Delimited (TSV)   2D SDfile   Computed 3D by Vconf -m prep SDfile
Find this compound or compounds like it in BindingDB:
Activity Spreadsheet -- Enzyme Inhibition Constant Data from BindingDB
Found 1 hit for monomerid = 50014103
TargetRenin(Rattus norvegicus)
Upjohn
Curated by ChEMBL
LigandPNGBDBM50014103(CHEMBL263257 | N-[(D-Glucosylamino)carbonyl]-Pro-P...)
Affinity DataIC50:  1.10nM. Assay description: Tested invitro for inhibitory activity against plasma renin in rat models
In DepthDetails ArticlePubMed