BDBM50014141 6-Amino-2-(3,6-dibenzyl-7-methyl-2,5,9-trioxo-[1,4]diazonan-1-yl)-hexanoic acid [2-(1H-indol-3-yl)-1-(3-methyl-butylcarbamoyl)-ethyl]-amide::CHEMBL264225
SMILES CC(C)CCNC(=O)[C@H](Cc1c[nH]c2ccccc12)NC(=O)[C@H](CCCCN)N1C(=O)CN[C@H](Cc2ccccc2)C(=O)N[C@@H](Cc2ccccc2)C1=O
InChI Key InChIKey=HSOSMQBCQQNBJI-HQPLKVBUSA-N
Data  1 IC50
  Tab Delimited (TSV)   2D SDfile   Computed 3D by Vconf -m prep SDfile
Find this compound or compounds like it in BindingDB:
Activity Spreadsheet -- Enzyme Inhibition Constant Data from BindingDB
Found 1 hit for monomerid = 50014141
TargetRenin(Homo sapiens (Human))
Ici Pharmaceuticals Group
Curated by ChEMBL
LigandPNGBDBM50014141(6-Amino-2-(3,6-dibenzyl-7-methyl-2,5,9-trioxo-[1,4...)
Affinity DataIC50:  2.74E+3nM. Assay description: Inhibition of human renin
In DepthDetails ArticlePubMed