BDBM50014222 1-Methyl-2-(1-propyl-1H-indol-3-yl)-ethylamine::CHEMBL328750
SMILES CCCn1cc(CC(C)N)c2ccccc12
InChI Key InChIKey=YISGDWSLBBTJAE-UHFFFAOYSA-N
Data  2 KI
  Tab Delimited (TSV)   2D SDfile   Computed 3D by Vconf -m prep SDfile
Find this compound or compounds like it in BindingDB:
Activity Spreadsheet -- Enzyme Inhibition Constant Data from BindingDB
Found 2 hits for monomerid = 50014222
Target5-hydroxytryptamine receptor 1A(Rattus norvegicus (rat))
Virginia Commonwealth University
Curated by ChEMBL
LigandPNGBDBM50014222(1-Methyl-2-(1-propyl-1H-indol-3-yl)-ethylamine | C...)
Affinity DataKi:  715nM. Assay description: Binding affinity against 5-hydroxytryptamine 1A receptor using [3H]-8-OH-DPAT as radioligand
In DepthDetails ArticlePubMed
TargetSerotonin 2 (5-HT2) receptor(RAT)
Virginia Commonwealth University
Curated by ChEMBL
LigandPNGBDBM50014222(1-Methyl-2-(1-propyl-1H-indol-3-yl)-ethylamine | C...)
Affinity DataKi:  1.55E+3nM. Assay description: Binding affinity against 5-hydroxytryptamine 2 receptor using [3H]ketanserin as radioligand
In DepthDetails ArticlePubMed