BDBM50014227 6-(4-Methanesulfinyl-phenyl)-1,2,3,5,6,10b-hexahydro-pyrrolo[2,1-a]isoquinoline::CHEMBL96615
SMILES CS(=O)c1ccc(cc1)C1CN2CCCC2c2ccccc12
InChI Key InChIKey=ZZEZIZXQPFAXHQ-UHFFFAOYSA-N
Data  3 KI
  Tab Delimited (TSV)   2D SDfile   Computed 3D by Vconf -m prep SDfile
Find this compound or compounds like it in BindingDB:
Activity Spreadsheet -- Enzyme Inhibition Constant Data from BindingDB
Found 3 hits for monomerid = 50014227
TargetSodium-dependent dopamine transporter(MOUSE)
Mcneil Pharmaceutical
Curated by ChEMBL
LigandPNGBDBM50014227(6-(4-Methanesulfinyl-phenyl)-1,2,3,5,6,10b-hexahyd...)
Affinity DataKi:  597nM. Assay description: Tested in vitro for dopamine(DA) neuronal uptake inhibition
In DepthDetails ArticlePubMed
TargetSodium-dependent noradrenaline transporter(MOUSE)
Mcneil Pharmaceutical
Curated by ChEMBL
LigandPNGBDBM50014227(6-(4-Methanesulfinyl-phenyl)-1,2,3,5,6,10b-hexahyd...)
Affinity DataKi:  723nM. Assay description: Tested in vitro for norepinephrine (NE) neuronal uptake inhibition
In DepthDetails ArticlePubMed
TargetSodium-dependent dopamine transporter(MOUSE)
Mcneil Pharmaceutical
Curated by ChEMBL
LigandPNGBDBM50014227(6-(4-Methanesulfinyl-phenyl)-1,2,3,5,6,10b-hexahyd...)
Affinity DataKi:  6.18E+3nM. Assay description: Tested in vitro for dopamine(DA) neuronal uptake inhibition
In DepthDetails ArticlePubMed