BDBM50014477 (S)-2-(4-(((2-(fluoromethyl)-4-oxo-3,4-dihydroquinazolin-6-yl)methyl)(prop-2-ynyl)amino)benzamido)pentanedioic acid::2-{4-[(2-Fluoromethyl-4-oxo-3,4-dihydro-quinazolin-6-ylmethyl)-prop-2-ynyl-amino]-benzoylamino}-pentanedioic acid::CHEMBL322176
SMILES OC(=O)CC[C@H](NC(=O)c1ccc(cc1)N(CC#C)Cc1ccc2nc(CF)[nH]c(=O)c2c1)C(O)=O
InChI Key InChIKey=LTFJMOXBVRLPOK-FQEVSTJZSA-N
Data  2 IC50
  Tab Delimited (TSV)   2D SDfile   Computed 3D by Vconf -m prep SDfile
Find this compound or compounds like it in BindingDB:
Activity Spreadsheet -- Enzyme Inhibition Constant Data from BindingDB
Found 2 hits for monomerid = 50014477
TargetThymidylate synthase(Homo sapiens (Human))
Meerut Institute Of Engineering And Technology
Curated by ChEMBL
LigandPNGBDBM50014477((S)-2-(4-(((2-(fluoromethyl)-4-oxo-3,4-dihydroquin...)
Affinity DataIC50:  575nM. Assay description: Inhibition of thymidylate synthase
In DepthDetails ArticlePubMed
TargetThymidylate synthase(Mus musculus)
Ici Pharmaceuticals Group
Curated by ChEMBL
LigandPNGBDBM50014477((S)-2-(4-(((2-(fluoromethyl)-4-oxo-3,4-dihydroquin...)
Affinity DataIC50:  100nM. Assay description: Concentration required for in vitro inhibition of thymidylate synthase
In DepthDetails ArticlePubMed