BDBM50014503 (S)-2-(4-(ethyl((2-methyl-4-oxo-3,4-dihydroquinazolin-6-yl)methyl)amino)-3-fluorobenzamido)pentanedioic acid::2-{4-[Ethyl-(2-methyl-4-oxo-3,4-dihydro-quinazolin-6-ylmethyl)-amino]-3-fluoro-benzoylamino}-pentanedioic acid::CHEMBL105384
SMILES CCN(Cc1ccc2nc(C)[nH]c(=O)c2c1)c1ccc(cc1F)C(=O)N[C@@H](CCC(O)=O)C(O)=O
InChI Key InChIKey=NZSFZOFCTJTVCG-IBGZPJMESA-N
Data  2 IC50
  Tab Delimited (TSV)   2D SDfile   Computed 3D by Vconf -m prep SDfile
Find this compound or compounds like it in BindingDB:
Activity Spreadsheet -- Enzyme Inhibition Constant Data from BindingDB
Found 2 hits for monomerid = 50014503
TargetThymidylate synthase(Homo sapiens (Human))
Meerut Institute Of Engineering And Technology
Curated by ChEMBL
LigandPNGBDBM50014503((S)-2-(4-(ethyl((2-methyl-4-oxo-3,4-dihydroquinazo...)
Affinity DataIC50:  676nM. Assay description: Inhibition of thymidylate synthase
In DepthDetails ArticlePubMed
TargetThymidylate synthase(Mus musculus)
Ici Pharmaceuticals Group
Curated by ChEMBL
LigandPNGBDBM50014503((S)-2-(4-(ethyl((2-methyl-4-oxo-3,4-dihydroquinazo...)
Affinity DataIC50:  680nM. Assay description: Inhibition of partially purified thymidylate synthase (TS)
In DepthDetails ArticlePubMed