BDBM50014516 (S)-2-(4-(allyl((2-methyl-4-oxo-3,4-dihydroquinazolin-6-yl)methyl)amino)-2-fluorobenzamido)pentanedioic acid::2-{4-[Allyl-(2-methyl-4-oxo-3,4-dihydro-quinazolin-6-ylmethyl)-amino]-2-fluoro-benzoylamino}-pentanedioic acid::CHEMBL320108
SMILES Cc1nc2ccc(CN(CC=C)c3ccc(C(=O)N[C@@H](CCC(O)=O)C(O)=O)c(F)c3)cc2c(=O)[nH]1
InChI Key InChIKey=FOKWCWLXPGZVGU-NRFANRHFSA-N
Data  2 IC50
  Tab Delimited (TSV)   2D SDfile   Computed 3D by Vconf -m prep SDfile
Find this compound or compounds like it in BindingDB:
Activity Spreadsheet -- Enzyme Inhibition Constant Data from BindingDB
Found 2 hits for monomerid = 50014516
TargetThymidylate synthase(Homo sapiens (Human))
Meerut Institute Of Engineering And Technology
Curated by ChEMBL
LigandPNGBDBM50014516((S)-2-(4-(allyl((2-methyl-4-oxo-3,4-dihydroquinazo...)
Affinity DataIC50:  76nM. Assay description: Inhibition of thymidylate synthase
In DepthDetails ArticlePubMed
TargetThymidylate synthase(Mus musculus)
Ici Pharmaceuticals Group
Curated by ChEMBL
LigandPNGBDBM50014516((S)-2-(4-(allyl((2-methyl-4-oxo-3,4-dihydroquinazo...)
Affinity DataIC50:  76nM. Assay description: Inhibition of partially purified thymidylate synthase (TS)
In DepthDetails ArticlePubMed