BDBM50014526 (S)-2-(2-methyl-4-(((2-methyl-4-oxo-3,4-dihydroquinazolin-6-yl)methyl)(prop-2-ynyl)amino)benzamido)pentanedioic acid::2-{2-Methyl-4-[(2-methyl-4-oxo-3,4-dihydro-quinazolin-6-ylmethyl)-prop-2-ynyl-amino]-benzoylamino}-pentanedioic acid::CHEMBL323294
SMILES Cc1nc2ccc(CN(CC#C)c3ccc(C(=O)N[C@@H](CCC(O)=O)C(O)=O)c(C)c3)cc2c(=O)[nH]1
InChI Key InChIKey=LUWVSZMWAFOPLY-QFIPXVFZSA-N
Data  2 IC50
  Tab Delimited (TSV)   2D SDfile   Computed 3D by Vconf -m prep SDfile
Find this compound or compounds like it in BindingDB:
Activity Spreadsheet -- Enzyme Inhibition Constant Data from BindingDB
Found 2 hits for monomerid = 50014526
TargetThymidylate synthase(Homo sapiens (Human))
Meerut Institute Of Engineering And Technology
Curated by ChEMBL
LigandPNGBDBM50014526((S)-2-(2-methyl-4-(((2-methyl-4-oxo-3,4-dihydroqui...)
Affinity DataIC50:  501nM. Assay description: Inhibition of thymidylate synthase
In DepthDetails ArticlePubMed
TargetThymidylate synthase(Mus musculus)
Ici Pharmaceuticals Group
Curated by ChEMBL
LigandPNGBDBM50014526((S)-2-(2-methyl-4-(((2-methyl-4-oxo-3,4-dihydroqui...)
Affinity DataIC50:  500nM. Assay description: Inhibition of partially purified thymidylate synthase (TS)
In DepthDetails ArticlePubMed