BDBM50014575 CHEMBL24108::[1-(1-Benzyl-3,3,3-trifluoro-2-oxo-propylcarbamoyl)-2-methyl-propyl]-carbamic acid benzyl ester
SMILES CC(C)[C@H](NC(=O)OCc1ccccc1)C(=O)N[C@H](Cc1ccccc1)C(=O)C(F)(F)F
InChI Key InChIKey=DXDPWHUNDIALES-MOPGFXCFSA-N
Data  1 KI
  Tab Delimited (TSV)   2D SDfile   Computed 3D by Vconf -m prep SDfile
Find this compound or compounds like it in BindingDB:
Activity Spreadsheet -- Enzyme Inhibition Constant Data from BindingDB
Found 1 hit for monomerid = 50014575
TargetChymotrypsinogen A(Bos taurus (bovine))
Merrell Dow Research Institute
Curated by ChEMBL
LigandPNGBDBM50014575(CHEMBL24108 | [1-(1-Benzyl-3,3,3-trifluoro-2-oxo-p...)
Affinity DataKi:  4.50E+4nM. Assay description: Inhibition of alpha-chymotrypsin
In DepthDetails ArticlePubMed