BDBM50014748 3-[(1-{2-[2-(3-Methoxycarbonyl-propionylamino)-propionylamino]-propionyl}-pyrrolidine-2-carbonyl)-amino]-4-methyl-2-oxo-pentanoic acid methyl ester::CHEMBL436383
SMILES COC(=O)CCC(=O)N[C@@H](C)C(=O)N[C@@H](C)C(=O)N1CCC[C@H]1C(=O)N[C@@H](C(C)C)C(=O)C(=O)OC
InChI Key InChIKey=LMBCPECAZNCURR-XSWJXKHESA-N
Data  3 KI
  Tab Delimited (TSV)   2D SDfile   Computed 3D by Vconf -m prep SDfile
Find this compound or compounds like it in BindingDB:
Activity Spreadsheet -- Enzyme Inhibition Constant Data from BindingDB
Found 3 hits for monomerid = 50014748
TargetChymotrypsin-like elastase family member 1(Homo sapiens (Human))
Merrell Dow Research Institute
Curated by ChEMBL
LigandPNGBDBM50014748(3-[(1-{2-[2-(3-Methoxycarbonyl-propionylamino)-pro...)
Affinity DataKi:  200nM. Assay description: Binding affinity against human Elastase
In DepthDetails ArticlePubMed
TargetNeutrophil elastase(Homo sapiens (Human))
Cinc
Curated by ChEMBL
LigandPNGBDBM50014748(3-[(1-{2-[2-(3-Methoxycarbonyl-propionylamino)-pro...)
Affinity DataKi:  200nM. Assay description: Tested for rate of substrate hydrolysis in the presence of human neutrophil elastase
In DepthDetails ArticlePubMed
TargetChymotrypsin-like elastase family member 1/2A(Sus scrofa (Pig))
Merrell Dow Research Institute
Curated by ChEMBL
LigandPNGBDBM50014748(3-[(1-{2-[2-(3-Methoxycarbonyl-propionylamino)-pro...)
Affinity DataKi:  680nM. Assay description: Binding affinity for porcine Elastase
In DepthDetails ArticlePubMed