BDBM50014819 (E)-6-{2-[6-tert-Butyl-4-(4-fluoro-phenyl)-2-isopropyl-pyridin-3-yl]-vinyl}-4-hydroxy-tetrahydro-pyran-2-one::CHEMBL2368187
SMILES CC(C)c1cc(-c2ccc(F)cc2)c(\C=C\[C@@H]2C[C@@H](O)CC(=O)O2)c(n1)C(C)C
InChI Key InChIKey=KRMZQAVPDOZLBC-BGGMYYEUSA-N
Data  1 IC50
  Tab Delimited (TSV)   2D SDfile   Computed 3D by Vconf -m prep SDfile
Find this compound or compounds like it in BindingDB:
Activity Spreadsheet -- Enzyme Inhibition Constant Data from BindingDB
Found 1 hit for monomerid = 50014819
Target3-hydroxy-3-methylglutaryl-coenzyme A reductase(Rattus norvegicus (rat))
Hoechst
Curated by ChEMBL
LigandPNGBDBM50014819((E)-6-{2-[6-tert-Butyl-4-(4-fluoro-phenyl)-2-isopr...)
Affinity DataIC50:  3nM. Assay description: In vitro inhibition of rat liver HMG-CoA reductase
In DepthDetails ArticlePubMed