BDBM50014820 (E)-6-{2-[2-Cyclohexyl-4-(4-fluoro-phenyl)-6-isopropyl-pyrimidin-5-yl]-vinyl}-4-hydroxy-tetrahydro-pyran-2-one::CHEMBL2368189
SMILES CC(C)c1nc(nc(-c2ccc(F)cc2)c1\C=C\[C@@H]1C[C@@H](O)CC(=O)O1)C1CCCCC1
InChI Key InChIKey=TUUVFNSQWXOUDX-DDVDASKDSA-N
Data  2 IC50
  Tab Delimited (TSV)   2D SDfile   Computed 3D by Vconf -m prep SDfile
Find this compound or compounds like it in BindingDB:
Activity Spreadsheet -- Enzyme Inhibition Constant Data from BindingDB
Found 2 hits for monomerid = 50014820
Target3-hydroxy-3-methylglutaryl-coenzyme A reductase(Rattus norvegicus (rat))
Hoechst
Curated by ChEMBL
LigandPNGBDBM50014820((E)-6-{2-[2-Cyclohexyl-4-(4-fluoro-phenyl)-6-isopr...)
Affinity DataIC50:  1nM. Assay description: In vitro inhibition of rat liver HMG-CoA reductase
In DepthDetails ArticlePubMed
Target3-hydroxy-3-methylglutaryl-coenzyme A reductase(Homo sapiens (Human))
Hoechst
Curated by ChEMBL
LigandPNGBDBM50014820((E)-6-{2-[2-Cyclohexyl-4-(4-fluoro-phenyl)-6-isopr...)
Affinity DataIC50:  1nM. Assay description: Inhibition of cellular HMG-CoA reductase in cultures of human HEP G2 cells, determined by decreased incorporation of sodium [14C]-acetate into choles...
In DepthDetails ArticlePubMed