BDBM50014958 6-[2-(8-Bromo-naphthalen-1-yl)-vinyl]-4-hydroxy-tetrahydro-pyran-2-one::CHEMBL2368310
SMILES O[C@@H]1C[C@H](OC(=O)C1)\C=C\c1cccc2cccc(Br)c12
InChI Key InChIKey=DXIFCCAKJPUXII-GODNBWANSA-N
Data  1 IC50
  Tab Delimited (TSV)   2D SDfile   Computed 3D by Vconf -m prep SDfile
Find this compound or compounds like it in BindingDB:
Activity Spreadsheet -- Enzyme Inhibition Constant Data from BindingDB
Found 1 hit for monomerid = 50014958
Target3-hydroxy-3-methylglutaryl-coenzyme A reductase(Rattus norvegicus (rat))
Merck Sharp & Dohme Research Laboratories
Curated by ChEMBL
LigandPNGBDBM50014958(6-[2-(8-Bromo-naphthalen-1-yl)-vinyl]-4-hydroxy-te...)
Affinity DataIC50:  4.12E+3nM. Assay description: Inhibitory activity against HMG-CoA reductase
In DepthDetails ArticlePubMed