BDBM50014987 CHEMBL3262087
SMILES CN(C1=C(Nc2cc(C)cc(C)c2)C(=O)c2ccccc2C1=O)S(=O)(=O)c1ccccc1
InChI Key InChIKey=XLJVKTMGPXLBLZ-UHFFFAOYSA-N
Data  2 IC50
  Tab Delimited (TSV)   2D SDfile   Computed 3D by Vconf -m prep SDfile
Find this compound or compounds like it in BindingDB:
Activity Spreadsheet -- Enzyme Inhibition Constant Data from BindingDB
Found 2 hits for monomerid = 50014987
TargetArylamine N-acetyltransferase 2(Mus musculus)
University Of Oxford
Curated by ChEMBL
LigandPNGBDBM50014987(CHEMBL3262087)
Affinity DataIC50: >1.50E+5nM. Assay description: Inhibition of recombinant N-terminal His6-tagged mouse NAT2 expressed in Escherichia coli Rosetta(DE3)pLysS cells assessed as rate of free thiol coen...
In DepthDetails ArticlePubMed
TargetArylamine N-acetyltransferase 1(Homo sapiens (Human))
University Of Oxford
Curated by ChEMBL
LigandPNGBDBM50014987(CHEMBL3262087)
Affinity DataIC50:  5.80E+3nM. Assay description: Inhibition of human NAT1 assessed as rate of free thiol coenzyme A production using arylamine and AcCoA as substrate by Ellman's method
In DepthDetails ArticlePubMed