BDBM50015152 CHEMBL115468::N-hydroxy-1-naphthamide::Naphthalene-1-carboxylic acid hydroxyamide
SMILES ONC(=O)c1cccc2ccccc12
InChI Key InChIKey=JRZGPWOEHDOVMC-UHFFFAOYSA-N
Data  7 IC50  2 Kd
PDB links: 2 PDB IDs match this monomer.
  Tab Delimited (TSV)   2D SDfile   Computed 3D by Vconf -m prep SDfile
Find this compound or compounds like it in BindingDB:
Activity Spreadsheet -- Enzyme Inhibition Constant Data from BindingDB
Found 9 hits for monomerid = 50015152
TargetPolyunsaturated fatty acid 5-lipoxygenase(Rattus norvegicus)
Abbott Laboratories
Curated by ChEMBL
LigandPNGBDBM50015152(CHEMBL115468 | N-hydroxy-1-naphthamide | Naphthale...)
Affinity DataIC50:  4.30E+4nM. Assay description: In vitro inhibitory activity against 5-lipoxygenase in rat basophilic leukemia cells(RBL-1)
In DepthDetails ArticlePubMed
TargetStromelysin-1(Homo sapiens (Human))
Abbott Laboratories
Curated by ChEMBL
LigandPNGBDBM50015152(CHEMBL115468 | N-hydroxy-1-naphthamide | Naphthale...)
Affinity DataKd:  5.00E+4nM. Assay description: Binding to stromelysin (MMP-3) in place of acetohydroxamic acid.
In DepthDetails ArticlePubMed
TargetStromelysin-1(Homo sapiens (Human))
Abbott Laboratories
Curated by ChEMBL
LigandPNGBDBM50015152(CHEMBL115468 | N-hydroxy-1-naphthamide | Naphthale...)
Affinity DataIC50:  5.00E+4nM. Assay description: Inhibition of Stromelysin (MMP-3)
In DepthDetails ArticlePubMed
TargetHistone deacetylase 8(Homo sapiens (Human))
Ithaca College
Curated by ChEMBL
LigandPNGBDBM50015152(CHEMBL115468 | N-hydroxy-1-naphthamide | Naphthale...)
Affinity DataIC50:  1.40E+4nM. Assay description: Inhibition of human HDAC8 by [3H]acetyl histone peptide assay
In DepthDetails ArticlePubMed
TargetPolyunsaturated fatty acid 5-lipoxygenase(Rattus norvegicus)
Abbott Laboratories
Curated by ChEMBL
LigandPNGBDBM50015152(CHEMBL115468 | N-hydroxy-1-naphthamide | Naphthale...)
Affinity DataIC50:  4.27E+4nM. Assay description: Logarithmic value of inhibitory concentration against 5-lipoxygenase in rat basophilic leukemia cells (RBL-1)
In DepthDetails ArticlePubMed
TargetHistone deacetylase 1(Homo sapiens (Human))
Ithaca College
Curated by ChEMBL
LigandPNGBDBM50015152(CHEMBL115468 | N-hydroxy-1-naphthamide | Naphthale...)
Affinity DataIC50: >1.00E+5nM. Assay description: Inhibition of human HDAC1 by [3H]acetyl histone peptide assay
In DepthDetails ArticlePubMed
TargetPolyunsaturated fatty acid 5-lipoxygenase(Rattus norvegicus)
Abbott Laboratories
Curated by ChEMBL
LigandPNGBDBM50015152(CHEMBL115468 | N-hydroxy-1-naphthamide | Naphthale...)
Affinity DataIC50:  4.30E+4nM. Assay description: In vitro inhibitory activity against RBL-1 5-LO
In DepthDetails ArticlePubMed
TargetStromelysin-1(Homo sapiens (Human))
Abbott Laboratories
Curated by ChEMBL
LigandPNGBDBM50015152(CHEMBL115468 | N-hydroxy-1-naphthamide | Naphthale...)
Affinity DataKd:  5.00E+4nM. Assay description: Dissociation constant for Matrix Metalloprotease-3 (MMP-3)
In DepthDetails ArticlePubMed
TargetHistone deacetylase 6(Homo sapiens (Human))
Ithaca College
Curated by ChEMBL
LigandPNGBDBM50015152(CHEMBL115468 | N-hydroxy-1-naphthamide | Naphthale...)
Affinity DataIC50: >1.00E+5nM. Assay description: Inhibition of human HDAC6 by [3H]acetyl histone peptide assay
In DepthDetails ArticlePubMed