BDBM50015657 (2S,3S,4R)-5-((R)-6-Amino-2-phenethylamino-purin-9-yl)-3,4-dihydroxy-tetrahydro-furan-2-carboxylic acid cyclopropylamide::CHEMBL2374465
SMILES Nc1nc(NCCc2ccccc2)nc2n(cnc12)[C@@H]1O[C@@H]([C@@H](O)[C@H]1O)C(=O)NC1CC1
InChI Key InChIKey=HKEMQEHNMNMOKS-KSVNGYGVSA-N
Data  2 KI
  Tab Delimited (TSV)   2D SDfile   Computed 3D by Vconf -m prep SDfile
Find this compound or compounds like it in BindingDB:
Activity Spreadsheet -- Enzyme Inhibition Constant Data from BindingDB
Found 2 hits for monomerid = 50015657
TargetAdenosine receptor A2a/A2b(Rattus norvegicus)
Ciba-Geigy
Curated by ChEMBL
LigandPNGBDBM50015657((2S,3S,4R)-5-((R)-6-Amino-2-phenethylamino-purin-9...)
Affinity DataKi:  14nM. Assay description: Binding to Adenosine A2 receptor was measured in ADA-pretreated rat striatal membranes using [3H]-CGS- 21680
In DepthDetails ArticlePubMed
TargetAdenosine receptor A1(Rattus norvegicus (rat))
Ciba-Geigy
Curated by ChEMBL
LigandPNGBDBM50015657((2S,3S,4R)-5-((R)-6-Amino-2-phenethylamino-purin-9...)
Affinity DataKi:  502nM. Assay description: Adenosine A1 receptor binding was measured in adenosine deaminase (ADA) pretreated rat cortical membranes using [3H]cyclohexyladenosine in the presen...
In DepthDetails ArticlePubMed