BDBM50015945 CHEMBL3260626::USRE47141, Example 47
SMILES COc1cc(NCc2nc(c([nH]2)-c2cccc(C)n2)-c2ccc3ncnn3c2)cc(OC)c1
InChI Key InChIKey=BNNWZGOUJUVYIT-UHFFFAOYSA-N
Data  3 IC50
  Tab Delimited (TSV)   2D SDfile   Computed 3D by Vconf -m prep SDfile
Find this compound or compounds like it in BindingDB:
Activity Spreadsheet -- Enzyme Inhibition Constant Data from BindingDB
Found 3 hits for monomerid = 50015945
TargetTGF-beta receptor type-1(Homo sapiens (Human))
Ewha Womans University
Curated by ChEMBL
LigandPNGBDBM50015945(CHEMBL3260626 | USRE47141, Example 47)
Affinity DataIC50:  14nM. Assay description: Inhibition of human recombinant ALK5 expressed in insect Sf9 cells using casein as substrate by radioisotopic assay
In DepthDetails ArticlePubMed
TargetTGF-beta receptor type-1(Homo sapiens (Human))
Ewha Womans University
Curated by ChEMBL
LigandPNGBDBM50015945(CHEMBL3260626 | USRE47141, Example 47)
Affinity DataIC50:  14.4nM. Assay description: ALK5 protein was expressed in Sf9 insect cells as human recombinant GST-fusion protein using the baculovirus expression system. Expressed protein was...
In DepthDetails US Patent
TargetTGF-beta receptor type-1(Homo sapiens (Human))
Ewha Womans University
Curated by ChEMBL
LigandPNGBDBM50015945(CHEMBL3260626 | USRE47141, Example 47)
Affinity DataIC50:  2.85E+3nM. Assay description: Inhibition of human recombinant p38alpha expressed in Escherichia coli using ATF2 as substrate by radioisotopic assay
In DepthDetails ArticlePubMed